{"text_format":"1","workbook":"xlsx","n_sheets":9,"sheets":["Consolidado 2010-2020","Ger Centralizada 2010-2020","transmissao 2010-2020","dist 2010-2020","mmgd 2010-2020","pee 2008-2020","p&d 2008-2020","IPCA","Base de dados nominais"],"not_rendered":{"charts":23,"images":2,"macros":1,"external_links":0,"defined_names":0,"comments":0,"pivot_tables":0},"unopened":[],"bounds":{"document_bytes":16777216,"sheet_cells":100000,"rows_first":2000,"rows_last":500,"rows_between":2000,"halvings":0,"cell_chars":16384,"cell_head_chars":4096},"cells_cut":0,"cells_raw":0,"read":"whole","date_system":"1900"}

{"sheet":"Consolidado 2010-2020","index":0,"n_rows":42,"n_cols":9,"rows_kept":42,"cut":false,"hidden":false,"merged":[[11,1,12,1],[27,1,28,1],[11,2,11,7],[27,2,27,7]]}
[]
[]
[]
[]
[]
[]
[]
[]
[]
[]
[]
[null,"ANO","Investimentos Anuais (R$ milhões)"]
[null,null,"Distribuição","MMGD","P&D","Eficiência Energética","Transmissão","Geração Centralizada","Total"]
[null,2010,{"$f":"'dist 2010-2020'!F13","v":18767.500488350939},null,{"$f":"'p&d 2008-2020'!C16","v":670.38929003195051},{"$f":"'pee 2008-2020'!D16","v":1014.1669619769078},{"$f":"'transmissao 2010-2020'!E13","v":7915.7115642168646},{"$f":"'Ger Centralizada 2010-2020'!I14","v":33585.870401256579},{"$f":"SUM(C14:H14)","v":61953.638705833248}]
[null,2011,{"$f":"'dist 2010-2020'!F14","v":17211.918908012682},null,{"$f":"'p&d 2008-2020'!C17","v":592.06595913952924},{"$f":"'pee 2008-2020'!D17","v":802.79946474773556},{"$f":"'transmissao 2010-2020'!E14","v":8937.9931560302757},{"$f":"'Ger Centralizada 2010-2020'!I15","v":31148.265997042698},{"$f":"SUM(C15:H15)","v":58693.043484972921}]
{"$rows_left_out":28}
{"sheet":"Ger Centralizada 2010-2020","index":1,"n_rows":57,"n_cols":10,"rows_kept":57,"cut":false,"hidden":false,"merged":[[44,1,44,8],[11,1,11,8],[27,1,27,8]]}
[]
[]
[]
[]
[]
[]
[]
[]
[]
[]
[]
[null,"Investimentos em Geração Centralizada (milhões de reais)"]
[null,"Ano","Eólica","PCH","Fotovoltaica","UHE","Biomassa","UTE Fóssil","Total Geral"]
[null,2010,{"$f":"IF('Base de dados nominais'!$N$7=12,'Base de dados nominais'!C79,'Base de dados nominais'!C79*(VLOOKUP(VLOOKUP('Base de dados nominais'!$N$7,'Base de dados nominais'!$K$2:$M$13,3,),IPCA!$B$4:$D$46,2,0)/VLOOKUP(DATE($B14,12,1),IPCA!$B$4:$D$46,2,0)))","v":3415.9150955031182},{"$f":"IF('Base de dados nominais'!$N$7=12,'Base de dados nominais'!D79,'Base de dados nominais'!D79*(VLOOKUP(VLOOKUP('Base de dados nominais'!$N$7,'Base de dados nominais'!$K$2:$M$13,3,),IPCA!$B$4:$D$46,2,0)/VLOOKUP(DATE($B14,12,1),IPCA!$B$4:$D$46,2,0)))","v":3788.3394383917876},{"$f":"IF('Base de dados nominais'!$N$7=12,'Base de dados nominais'!E79,'Base de dados nominais'!E79*(VLOOKUP(VLOOKUP('Base de dados nominais'!$N$7,'Base de dados nominais'!$K$2:$M$13,3,),IPCA!$B$4:$D$46,2,0)/VLOOKUP(DATE($B14,12,1),IPCA!$B$4:$D$46,2,0)))","v":0},{"$f":"IF('Base de dados nominais'!$N$7=12,'Base de dados nominais'!F79,'Base de dados nominais'!F79*(VLOOKUP(VLOOKUP('Base de dados nominais'!$N$7,'Base de dados nominais'!$K$2:$M$13,3,),IPCA!$B$4:$D$46,2,0)/VLOOKUP(DATE($B14,12,1),IPCA!$B$4:$D$46,2,0)))","v":16946.11582438197},{"$f":"IF('Base de dados nominais'!$N$7=12,'Base de dados nominais'!G79,'Base de dados nominais'!G79*(VLOOKUP(VLOOKUP('Base de dados nominais'!$N$7,'Base de dados nominais'!$K$2:$M$13,3,),IPCA!$B$4:$D$46,2,0)/VLOOKUP(DATE($B14,12,1),IPCA!$B$4:$D$46,2,0)))","v":2817.3579646550884},{"$f":"IF('Base de dados nominais'!$N$7=12,'Base de dados nominais'!H79,'Base de dados nominais'!H79*(VLOOKUP(VLOOKUP('Base de dados nominais'!$N$7,'Base de dados nominais'!$K$2:$M$13,3,),IPCA!$B$4:$D$46,2,0)/VLOOKUP(DATE($B14,12,1),IPCA!$B$4:$D$46,2,0)))","v":6618.1420783246131},{"$f":"SUM(C14:H14)","v":33585.870401256579}]
[null,2011,{"$f":"IF('Base de dados nominais'!$N$7=12,'Base de dados nominais'!C80,'Base de dados nominais'!C80*(VLOOKUP(VLOOKUP('Base de dados nominais'!$N$7,'Base de dados nominais'!$K$2:$M$13,3,),IPCA!$B$4:$D$46,2,0)/VLOOKUP(DATE($B15,12,1),IPCA!$B$4:$D$46,2,0)))","v":2633.5291517733781},{"$f":"IF('Base de dados nominais'!$N$7=12,'Base de dados nominais'!D80,'Base de dados nominais'!D80*(VLOOKUP(VLOOKUP('Base de dados nominais'!$N$7,'Base de dados nominais'!$K$2:$M$13,3,),IPCA!$B$4:$D$46,2,0)/VLOOKUP(DATE($B15,12,1),IPCA!$B$4:$D$46,2,0)))","v":2654.2200499652304},{"$f":"IF('Base de dados nominais'!$N$7=12,'Base de dados nominais'!E80,'Base de dados nominais'!E80*(VLOOKUP(VLOOKUP('Base de dados nominais'!$N$7,'Base de dados nominais'!$K$2:$M$13,3,),IPCA!$B$4:$D$46,2,0)/VLOOKUP(DATE($B15,12,1),IPCA!$B$4:$D$46,2,0)))","v":0},{"$f":"IF('Base de dados nominais'!$N$7=12,'Base de dados nominais'!F80,'Base de dados nominais'!F80*(VLOOKUP(VLOOKUP('Base de dados nominais'!$N$7,'Base de dados nominais'!$K$2:$M$13,3,),IPCA!$B$4:$D$46,2,0)/VLOOKUP(DATE($B15,12,1),IPCA!$B$4:$D$46,2,0)))","v":16733.10556408043},{"$f":"IF('Base de dados nominais'!$N$7=12,'Base de dados nominais'!G80,'Base de dados nominais'!G80*(VLOOKUP(VLOOKUP('Base de dados nominais'!$N$7,'Base de dados nominais'!$K$2:$M$13,3,),IPCA!$B$4:$D$46,2,0)/VLOOKUP(DATE($B15,12,1),IPCA!$B$4:$D$46,2,0)))","v":3377.9696075135953},{"$f":"IF('Base de dados nominais'!$N$7=12,'Base de dados nominais'!H80,'Base de dados nominais'!H80*(VLOOKUP(VLOOKUP('Base de dados nominais'!$N$7,'Base de dados nominais'!$K$2:$M$13,3,),IPCA!$B$4:$D$46,2,0)/VLOOKUP(DATE($B15,12,1),IPCA!$B$4:$D$46,2,0)))","v":5749.4416237100686},{"$f":"SUM(C15:H15)","v":31148.265997042698}]
{"$rows_left_out":43}
{"sheet":"transmissao 2010-2020","index":2,"n_rows":56,"n_cols":6,"rows_kept":56,"cut":false,"hidden":false,"merged":[[43,1,43,4],[10,1,10,6],[26,1,26,5]]}
[]
[]
[]
[]
[]
[]
[]
[]
[]
[]
[null,"Investimentos em Transmissão (milhões de reais)"]
[null,"Ano","LT","SE","Total Geral","%LT/Total"]
[null,2010,{"$f":"IF('Base de dados nominais'!$N$7=12,'Base de dados nominais'!C30,'Base de dados nominais'!C30*(VLOOKUP(VLOOKUP('Base de dados nominais'!$N$7,'Base de dados nominais'!$K$2:$M$13,3,),IPCA!$B$4:$D$46,2,0)/VLOOKUP(DATE($B13,12,1),IPCA!$B$4:$D$46,2,0)))","v":4268.9146782930802},{"$f":"IF('Base de dados nominais'!$N$7=12,'Base de dados nominais'!D30,'Base de dados nominais'!D30*(VLOOKUP(VLOOKUP('Base de dados nominais'!$N$7,'Base de dados nominais'!$K$2:$M$13,3,),IPCA!$B$4:$D$46,2,0)/VLOOKUP(DATE($B13,12,1),IPCA!$B$4:$D$46,2,0)))","v":3646.7968859237844},{"$f":"SUM(C13:D13)","v":7915.7115642168646},{"$f":"C13/E13","v":0.53929639093859816}]
[null,2011,{"$f":"IF('Base de dados nominais'!$N$7=12,'Base de dados nominais'!C31,'Base de dados nominais'!C31*(VLOOKUP(VLOOKUP('Base de dados nominais'!$N$7,'Base de dados nominais'!$K$2:$M$13,3,),IPCA!$B$4:$D$46,2,0)/VLOOKUP(DATE($B14,12,1),IPCA!$B$4:$D$46,2,0)))","v":4696.7240409304504},{"$f":"IF('Base de dados nominais'!$N$7=12,'Base de dados nominais'!D31,'Base de dados nominais'!D31*(VLOOKUP(VLOOKUP('Base de dados nominais'!$N$7,'Base de dados nominais'!$K$2:$M$13,3,),IPCA!$B$4:$D$46,2,0)/VLOOKUP(DATE($B14,12,1),IPCA!$B$4:$D$46,2,0)))","v":4241.2691150998253},8937.9931560302757,{"$f":"C14/E14","v":0.5254785899854566}]
[null,2012,{"$f":"IF('Base de dados nominais'!$N$7=12,'Base de dados nominais'!C32,'Base de dados nominais'!C32*(VLOOKUP(VLOOKUP('Base de dados nominais'!$N$7,'Base de dados nominais'!$K$2:$M$13,3,),IPCA!$B$4:$D$46,2,0)/VLOOKUP(DATE($B15,12,1),IPCA!$B$4:$D$46,2,0)))","v":5471.556203619908},{"$f":"IF('Base de dados nominais'!$N$7=12,'Base de dados nominais'!D32,'Base de dados nominais'!D32*(VLOOKUP(VLOOKUP('Base de dados nominais'!$N$7,'Base de dados nominais'!$K$2:$M$13,3,),IPCA!$B$4:$D$46,2,0)/VLOOKUP(DATE($B15,12,1),IPCA!$B$4:$D$46,2,0)))","v":4763.539045559859},10235.095249179767,0.53458771710584663]
{"$rows_left_out":42}
{"sheet":"dist 2010-2020","index":3,"n_rows":56,"n_cols":7,"rows_kept":56,"cut":false,"hidden":false,"merged":[[43,1,43,5],[10,1,10,5],[26,1,26,5]]}
[]
[]
[]
[]
[]
[]
[]
[]
[]
[]
[null,"Investimentos em distribuição de energia elétrica (milhões de reais)"]
[null,"Ano","Total",null,null,{"$f":"C12","v":"Total"}]
[null,2010,{"$f":"IF('Base de dados nominais'!$N$7=12,'Base de dados nominais'!$C2,'Base de dados nominais'!$C2*(VLOOKUP(VLOOKUP('Base de dados nominais'!$N$7,'Base de dados nominais'!$K$2:$M$13,3,),IPCA!$B$4:$D$46,2,0)/VLOOKUP(DATE($B13,12,1),IPCA!$B$4:$D$46,2,0)))","v":18767.500488350939},null,null,{"$f":"C13","v":18767.500488350939},{"$f":"C13/F13","v":1}]
[null,2011,{"$f":"IF('Base de dados nominais'!$N$7=12,'Base de dados nominais'!$C3,'Base de dados nominais'!$C3*(VLOOKUP(VLOOKUP('Base de dados nominais'!$N$7,'Base de dados nominais'!$K$2:$M$13,3,),IPCA!$B$4:$D$46,2,0)/VLOOKUP(DATE($B14,12,1),IPCA!$B$4:$D$46,2,0)))","v":17211.918908012682},null,null,17211.918908012682,{"$f":"C14/F14","v":1}]
[null,2012,{"$f":"IF('Base de dados nominais'!$N$7=12,'Base de dados nominais'!$C4,'Base de dados nominais'!$C4*(VLOOKUP(VLOOKUP('Base de dados nominais'!$N$7,'Base de dados nominais'!$K$2:$M$13,3,),IPCA!$B$4:$D$46,2,0)/VLOOKUP(DATE($B15,12,1),IPCA!$B$4:$D$46,2,0)))","v":18241.324048050497},null,null,18241.324048050497,1]
{"$rows_left_out":42}
{"sheet":"mmgd 2010-2020","index":4,"n_rows":56,"n_cols":9,"rows_kept":56,"cut":false,"hidden":false,"merged":[[43,1,43,6],[10,1,10,6],[26,1,26,6]]}
[]
[]
[]
[]
[]
[]
[]
[]
[]
[]
[null,"Investimentos em geração distribuída (milhões de reais)"]
[null,"Ano","Eólica","Fotovoltaica","Hidro","Termelétrica","Total Geral"]
[null,2010,{"$f":"IF('Base de dados nominais'!$N$7=12,'Base de dados nominais'!C16,'Base de dados nominais'!C16*(VLOOKUP(VLOOKUP('Base de dados nominais'!$N$7,'Base de dados nominais'!$K$2:$M$13,3,),IPCA!$B$4:$D$46,2,0)/VLOOKUP(DATE($B13,12,1),IPCA!$B$4:$D$46,2,0)))","v":0},{"$f":"IF('Base de dados nominais'!$N$7=12,'Base de dados nominais'!D16,'Base de dados nominais'!D16*(VLOOKUP(VLOOKUP('Base de dados nominais'!$N$7,'Base de dados nominais'!$K$2:$M$13,3,),IPCA!$B$4:$D$46,2,0)/VLOOKUP(DATE($B13,12,1),IPCA!$B$4:$D$46,2,0)))","v":0},{"$f":"IF('Base de dados nominais'!$N$7=12,'Base de dados nominais'!E16,'Base de dados nominais'!E16*(VLOOKUP(VLOOKUP('Base de dados nominais'!$N$7,'Base de dados nominais'!$K$2:$M$13,3,),IPCA!$B$4:$D$46,2,0)/VLOOKUP(DATE($B13,12,1),IPCA!$B$4:$D$46,2,0)))","v":0},{"$f":"IF('Base de dados nominais'!$N$7=12,'Base de dados nominais'!F16,'Base de dados nominais'!F16*(VLOOKUP(VLOOKUP('Base de dados nominais'!$N$7,'Base de dados nominais'!$K$2:$M$13,3,),IPCA!$B$4:$D$46,2,0)/VLOOKUP(DATE($B13,12,1),IPCA!$B$4:$D$46,2,0)))","v":0},{"$f":"SUM(C13:F13)","v":0}]
[null,2011,{"$f":"IF('Base de dados nominais'!$N$7=12,'Base de dados nominais'!C17,'Base de dados nominais'!C17*(VLOOKUP(VLOOKUP('Base de dados nominais'!$N$7,'Base de dados nominais'!$K$2:$M$13,3,),IPCA!$B$4:$D$46,2,0)/VLOOKUP(DATE($B14,12,1),IPCA!$B$4:$D$46,2,0)))","v":0},{"$f":"IF('Base de dados nominais'!$N$7=12,'Base de dados nominais'!D17,'Base de dados nominais'!D17*(VLOOKUP(VLOOKUP('Base de dados nominais'!$N$7,'Base de dados nominais'!$K$2:$M$13,3,),IPCA!$B$4:$D$46,2,0)/VLOOKUP(DATE($B14,12,1),IPCA!$B$4:$D$46,2,0)))","v":0},{"$f":"IF('Base de dados nominais'!$N$7=12,'Base de dados nominais'!E17,'Base de dados nominais'!E17*(VLOOKUP(VLOOKUP('Base de dados nominais'!$N$7,'Base de dados nominais'!$K$2:$M$13,3,),IPCA!$B$4:$D$46,2,0)/VLOOKUP(DATE($B14,12,1),IPCA!$B$4:$D$46,2,0)))","v":0},{"$f":"IF('Base de dados nominais'!$N$7=12,'Base de dados nominais'!F17,'Base de dados nominais'!F17*(VLOOKUP(VLOOKUP('Base de dados nominais'!$N$7,'Base de dados nominais'!$K$2:$M$13,3,),IPCA!$B$4:$D$46,2,0)/VLOOKUP(DATE($B14,12,1),IPCA!$B$4:$D$46,2,0)))","v":0},{"$f":"SUM(C14:F14)","v":0}]
[null,2012,{"$f":"IF('Base de dados nominais'!$N$7=12,'Base de dados nominais'!C18,'Base de dados nominais'!C18*(VLOOKUP(VLOOKUP('Base de dados nominais'!$N$7,'Base de dados nominais'!$K$2:$M$13,3,),IPCA!$B$4:$D$46,2,0)/VLOOKUP(DATE($B15,12,1),IPCA!$B$4:$D$46,2,0)))","v":0},{"$f":"IF('Base de dados nominais'!$N$7=12,'Base de dados nominais'!D18,'Base de dados nominais'!D18*(VLOOKUP(VLOOKUP('Base de dados nominais'!$N$7,'Base de dados nominais'!$K$2:$M$13,3,),IPCA!$B$4:$D$46,2,0)/VLOOKUP(DATE($B15,12,1),IPCA!$B$4:$D$46,2,0)))","v":0},{"$f":"IF('Base de dados nominais'!$N$7=12,'Base de dados nominais'!E18,'Base de dados nominais'!E18*(VLOOKUP(VLOOKUP('Base de dados nominais'!$N$7,'Base de dados nominais'!$K$2:$M$13,3,),IPCA!$B$4:$D$46,2,0)/VLOOKUP(DATE($B15,12,1),IPCA!$B$4:$D$46,2,0)))","v":0},{"$f":"IF('Base de dados nominais'!$N$7=12,'Base de dados nominais'!F18,'Base de dados nominais'!F18*(VLOOKUP(VLOOKUP('Base de dados nominais'!$N$7,'Base de dados nominais'!$K$2:$M$13,3,),IPCA!$B$4:$D$46,2,0)/VLOOKUP(DATE($B15,12,1),IPCA!$B$4:$D$46,2,0)))","v":0},0]
{"$rows_left_out":42}
{"sheet":"pee 2008-2020","index":5,"n_rows":44,"n_cols":5,"rows_kept":44,"cut":false,"hidden":false,"merged":[[11,2,11,3],[29,2,29,4]]}
[]
[]
[]
[]
[]
[]
[]
[]
[]
[]
[]
[null,null,"Investimentos do PEE (milhões)"]
[null,null,"Ano","PEE"]
[null,null,2008,{"$f":"IF('Base de dados nominais'!$N$7=12,'Base de dados nominais'!C46,'Base de dados nominais'!C46*(VLOOKUP(VLOOKUP('Base de dados nominais'!$N$7,'Base de dados nominais'!$K$2:$M$13,3,),IPCA!$B$4:$D$46,2,0)/VLOOKUP(DATE($C14,12,1),IPCA!$B$4:$D$46,2,0)))","v":266.66090886318034}]
[null,null,2009,{"$f":"IF('Base de dados nominais'!$N$7=12,'Base de dados nominais'!C47,'Base de dados nominais'!C47*(VLOOKUP(VLOOKUP('Base de dados nominais'!$N$7,'Base de dados nominais'!$K$2:$M$13,3,),IPCA!$B$4:$D$46,2,0)/VLOOKUP(DATE($C15,12,1),IPCA!$B$4:$D$46,2,0)))","v":593.43552252856421}]
{"$rows_left_out":30}
{"sheet":"p&d 2008-2020","index":6,"n_rows":44,"n_cols":4,"rows_kept":44,"cut":false,"hidden":false,"merged":[[11,1,11,2],[29,1,29,3]]}
[]
[]
[]
[]
[]
[]
[]
[]
[]
[]
[]
[null,"Investimentos do P&D (milhões)"]
[null,"Ano","P&D"]
[null,2008,{"$f":"IF('Base de dados nominais'!$N$7=12,'Base de dados nominais'!C62,'Base de dados nominais'!C62*(VLOOKUP(VLOOKUP('Base de dados nominais'!$N$7,'Base de dados nominais'!$K$2:$M$13,3,),IPCA!$B$4:$D$46,2,0)/VLOOKUP(DATE($B14,12,1),IPCA!$B$4:$D$46,2,0)))","v":182.35015594589089}]
[null,2009,{"$f":"IF('Base de dados nominais'!$N$7=12,'Base de dados nominais'!C63,'Base de dados nominais'!C63*(VLOOKUP(VLOOKUP('Base de dados nominais'!$N$7,'Base de dados nominais'!$K$2:$M$13,3,),IPCA!$B$4:$D$46,2,0)/VLOOKUP(DATE($B15,12,1),IPCA!$B$4:$D$46,2,0)))","v":462.95241462817347}]
{"$rows_left_out":30}
{"sheet":"IPCA","index":7,"n_rows":47,"n_cols":4,"rows_kept":47,"cut":false,"hidden":false,"merged":[[46,0,46,3],[0,0,0,3],[1,0,2,0],[1,1,2,1],[1,2,1,3],[3,0,45,0]]}
["Tabela 1737 - IPCA - Série histórica com número-índice, variação mensal e variações acumuladas em 3 meses, em 6 meses, no ano e em 12 meses (a partir de dezembro/1979)"]
[null,"Mês","Variável"]
[null,null,"IPCA - Número-índice (base: dezembro de 1993 = 100) (Número-índice)","IPCA - Variação acumulada no ano (%)"]
["Brasil","1979-12-01",7.6183000000000005E-9,"..."]
[null,"1980-12-01",1.51795E-8,99.25]
[null,"1981-12-01",2.96946E-8,95.62]
[null,"1982-12-01",6.0811699999999999E-8,104.79]
[null,"1983-12-01",1.605502E-7,164.01]
[null,"1984-12-01",5.0615590000000003E-7,215.26]
[null,"1985-12-01",1.7322163E-6,242.23]
[null,"1986-12-01",3.1121777E-6,79.66]
[null,"1987-12-01",1.44221901E-5,363.41]
[null,"1988-12-01",1.557904426E-4,980.21]
[null,"1989-12-01",3.2293981927000001E-3,1972.91]
[null,"1990-12-01",5.5576860018600002E-2,1620.97]
{"$rows_left_out":33}
{"sheet":"Base de dados nominais","index":8,"n_rows":89,"n_cols":21,"rows_kept":89,"cut":false,"hidden":false,"merged":[]}
["aba","Ano","Total",null,null,null,"Deflator","Valor BMP",null,null,null,"Seleção",null,null,null,null,null,null,null,"Ano do Movimento","Aplicações - R$ Mil"]
["Distribuição",2010,10786.421429329601,null,null,null,0.79489663499999996,13569.59,{"$f":"H2*G2","v":10786.42142932965},null,1,2010,"2010-12-01",null,null,null,null,null,null,2011,10535703]
["Distribuição",2011,10535.703,null,null,null,null,null,null,null,2,2011,"2011-12-01",null,null,null,null,null,null,2012,11817746]
["Distribuição",2012,11817.745999999999,null,null,null,null,null,null,null,3,2012,"2012-12-01",null,null,null,null,null,null,2013,10892790]
["Distribuição",2013,10892.79,null,null,null,null,null,null,null,4,2013,"2013-12-01",null,null,null,null,null,null,2014,10352739]
["Distribuição",2014,10352.739,null,null,null,null,null,null,null,5,2014,"2014-12-01",null,null,null,null,null,null,2015,11609050]
["Distribuição",2015,11609.05,null,null,null,null,null,null,null,6,2015,"2015-12-01",11,null,null,null,null,null,2016,13783892]
["Distribuição",2016,13783.892,null,null,null,null,null,null,null,7,2016,"2016-12-01",null,null,null,null,null,null,2017,15678350]
["Distribuição",2017,15678.35,null,null,null,null,null,null,null,8,2017,"2017-12-01",null,null,null,null,null,null,2018,15324206]
["Distribuição",2018,15324.206,null,null,null,null,null,null,null,9,2018,"2018-12-01",null,null,null,null,null,null,2019,17767268]
["Distribuição",2019,17767.268,null,null,null,null,null,null,null,10,2019,"2019-12-01",null,null,null,null,null,null,2020,19262158]
["Distribuição",2020,19262.157999999999,null,null,null,null,null,null,null,11,2020,"2020-12-01",null,null,null,null,null,null,2021,26230021]
[null,null,null,null,null,null,null,null,null,null,12,"Nominal"]
[]
[null,"Ano","Eólica","Fotovoltaica","Hidro","Termelétrica"]
{"$rows_left_out":74}