{"text_format":"1","workbook":"xlsx","n_sheets":8,"sheets":["Formulário","TiposBiodigestor","FactSheet 1-2","Metodologia","FluxoDeCaixa","FatorEmissao","SeriePreçoDiesel","PreçoDiesel"],"not_rendered":{"charts":3,"images":25,"macros":1,"external_links":0,"defined_names":40,"comments":3,"pivot_tables":0},"unopened":[],"bounds":{"document_bytes":16777216,"sheet_cells":100000,"rows_first":2000,"rows_last":500,"rows_between":2000,"halvings":0,"cell_chars":16384,"cell_head_chars":4096},"cells_cut":0,"cells_raw":0,"read":"whole","date_system":"1900"}

{"sheet":"Formulário","index":0,"n_rows":54,"n_cols":30,"rows_kept":54,"cut":false,"hidden":false,"merged":[[0,26,1,28],[10,10,11,10],[7,17,7,19],[53,26,53,27],[14,1,32,1],[32,10,33,10],[51,1,56,1],[53,2,55,2],[48,21,48,22],[46,17,47,17],[23,13,29,13],[28,21,29,22],[16,21,16,22],[16,14,16,16],[18,14,18,16],[29,8,30,9],[27,8,28,10],[1,1,12,1],[35,1,49,1],[5,13,5,14],[31,3,33,4],[20,14,20,18],[52,26,52,27],[9,16,10,18],[11,16,11,18],[29,14,29,16],[31,14,31,16],[46,13,47,16],[46,19,47,19],[46,21,47,22],[46,18,47,18],[6,13,9,14],[10,13,11,14],[26,21,27,22],[30,21,31,22]]}
[null,null,null,null,null,null,null,null,null,null,null,null,null,null,null,null,null,null,null,null,null,null,null,null,null,null,"QUADRO DE DADOS AUXILIARES"]
[null,"QUANTO SE USA ?"]
[]
[null,null,null,null,null,null,null,null,null,null,{"$f":"CONCATENATE(\"- \",ROUND((I6*I12/($AA$24/100))/1000,1))","v":"- 917,7"},null,null,null,null,null,null,null,null,null,null,null,null,null,null,null,500,8650]
[]
[null,null,null,"Distância média anual","[km/ano]",null,null,null,{"$f":"$AB$4*10","v":86500},null,null,null,null,{"$f":"CONCATENATE(\"- \",ROUND(FatorEmissao!$S$19*(I6*I12/($AA$24/100))/1000,0),\" kg/ano\")","v":"- 929 kg/ano"},null,null,null,null,null,null,null,null,null,null,null,null,null,1,301]
[null,null,null,null,null,null,null,null,null,null,null,null,null,{"$f":"CONCATENATE(\"- \",ROUND(FatorEmissao!$S$26*(I6*I12/($AA$24/100))/1000,0),\" kg/ano\")","v":"- 1368 kg/ano"}]
[null,null,null,"Dias de operação/ano","[dias/ano]",null,null,null,{"$f":"$AA$8","v":290},null,null,null,null,null,null,null,null,null,null,null,null,null,null,null,null,null,290]
[]
[null,null,null,"Distância diária média","[km/dia]",null,null,null,{"$f":"CONCATENATE(TRUNC($I$6/DiasDeOperacaoNoAno,0),\" km/dia\")","v":"298 km/dia"},null,{"$f":"CONCATENATE(\"- \",TRUNC(IF(OR(TipoBiodigestor=1,TipoBiodigestor=3),FatorEmissao!$R$35+FatorEmissao!$R$8*((I6*I12)/($AA$24/100))*FatorEmissao!$R$11/1000000,FatorEmissao!$R$8*((I6*I12)/($AA$24/100))*FatorEmissao!$R$11/1000000),1))","v":"- 16932"},null,null,null,null,null,"Rio de Janeiro",null,null,null,null,null,null,null,null,null,null,null,0,{"$f":"TiposBiodigestor!$D$7/((DistAnualAux*10)/DiasDeOperacaoNoAno)","v":16.76300578034682}]
{"$rows_left_out":45}
{"sheet":"TiposBiodigestor","index":1,"n_rows":7,"n_cols":6,"rows_kept":7,"cut":false,"hidden":false,"merged":[]}
["Índice","Tipo","Descrição","Capacidade","Custo","Preço"]
[1,"ATERRO","-",5000,"-",1.45]
[2,"RURAL C/ ADUBO","-",5000,"-",1.75]
[3,"URBANO","-",5000,"-",1.9]
[4,"RURAL","sem recursos de terceiros e TIR de 15%",5000,"-",2.37]
[]
[{"$f":"Formulário!AA12","v":1},{"$f":"VLOOKUP($A$7,TiposBiodigestor!$A$2:$F$5,2,0)","v":"ATERRO"},{"$f":"VLOOKUP($A$7,TiposBiodigestor!$A$2:$F$5,3,0)","v":"-"},{"$f":"VLOOKUP($A$7,TiposBiodigestor!$A$2:$F$5,4,0)","v":5000},{"$f":"VLOOKUP($A$7,TiposBiodigestor!$A$2:$F$5,5,0)","v":"-"},{"$f":"VLOOKUP($A$7,TiposBiodigestor!$A$2:$F$5,6,0)","v":1.45}]

{"sheet":"FactSheet 1-2","index":2,"n_rows":4,"n_cols":4,"rows_kept":4,"cut":false,"hidden":false,"merged":[[0,12,0,14]]}
[]
[]
[]
[null,null,null,1]

{"sheet":"Metodologia","index":3,"n_rows":0,"n_cols":0,"rows_kept":0,"cut":false,"hidden":false,"merged":[]}

{"sheet":"FluxoDeCaixa","index":4,"n_rows":73,"n_cols":16,"rows_kept":73,"cut":false,"hidden":false,"merged":[[64,12,64,13],[70,0,72,0],[0,0,0,11],[33,0,33,11],[49,0,49,1],[18,0,18,1],[64,0,64,11]]}
["Análise financeira por ônibus: Diesel Padron LE"]
["Ciclo de Avaliação de 10 anos",null,10]
["Vida útil do ônibus a diesel 5 anos"]
["Período",0,1,2,3,4,5,6,7,8,9,10]
["Custo de Aquisição",{"$f":"IF(CapexNovoUsado=3,0,IF(CapexNovoUsado=1,Formulário!R17,Formulário!R19))","v":510000},0,0,0,0,{"$f":"B5","v":510000},0,0,0,0,0]
["Custo de Infraestrutura de recarga",null,0,0,0,0,0,0,0,0,0,0]
["Custo Variável Anual",null,{"$f":"SUM(C8:C10)","v":349712.97468354425},{"$f":"SUM(D8:D10)","v":342368.97468354425},{"$f":"SUM(E8:E10)","v":335024.97468354425},{"$f":"SUM(F8:F10)","v":327680.97468354425},320336.97468354425,349712.97468354425,342368.97468354425,335024.97468354425,327680.97468354425,320336.97468354425]
["Custo Operacional",null,{"$f":"IF(C4<=$C$2,Formulário!$R$24*Formulário!$I$6,\"\")","v":164787.97468354428},{"$f":"IF(D4<=$C$2,Formulário!$R$24*Formulário!$I$6,\"\")","v":164787.97468354428},{"$f":"IF(E4<=$C$2,Formulário!$R$24*Formulário!$I$6,\"\")","v":164787.97468354428},{"$f":"IF(F4<=$C$2,Formulário!$R$24*Formulário!$I$6,\"\")","v":164787.97468354428},{"$f":"IF(G4<=$C$2,Formulário!$R$24*Formulário!$I$6,\"\")","v":164787.97468354428},{"$f":"IF(H4<=$C$2,Formulário!$R$24*Formulário!$I$6,\"\")","v":164787.97468354428},{"$f":"IF(I4<=$C$2,Formulário!$R$24*Formulário!$I$6,\"\")","v":164787.97468354428},{"$f":"IF(J4<=$C$2,Formulário!$R$24*Formulário!$I$6,\"\")","v":164787.97468354428},{"$f":"IF(K4<=$C$2,Formulário!$R$24*Formulário!$I$6,\"\")","v":164787.97468354428},{"$f":"IF(L4<=$C$2,Formulário!$R$24*Formulário!$I$6,\"\")","v":164787.97468354428}]
["Custo de Manutenção",null,{"$f":"IF(C4<=$C$2,Formulário!$R$30*Formulário!$I$6,\"\")","v":66605},{"$f":"IF(D4<=$C$2,Formulário!$R$30*Formulário!$I$6,\"\")","v":66605},{"$f":"IF(E4<=$C$2,Formulário!$R$30*Formulário!$I$6,\"\")","v":66605},{"$f":"IF(F4<=$C$2,Formulário!$R$30*Formulário!$I$6,\"\")","v":66605},{"$f":"IF(G4<=$C$2,Formulário!$R$30*Formulário!$I$6,\"\")","v":66605},{"$f":"IF(H4<=$C$2,Formulário!$R$30*Formulário!$I$6,\"\")","v":66605},{"$f":"IF(I4<=$C$2,Formulário!$R$30*Formulário!$I$6,\"\")","v":66605},{"$f":"IF(J4<=$C$2,Formulário!$R$30*Formulário!$I$6,\"\")","v":66605},{"$f":"IF(K4<=$C$2,Formulário!$R$30*Formulário!$I$6,\"\")","v":66605},{"$f":"IF(L4<=$C$2,Formulário!$R$30*Formulário!$I$6,\"\")","v":66605}]
["Custo de Financiamento",null,{"$f":"C32","v":118320},{"$f":"D32","v":110976},{"$f":"E32","v":103632},{"$f":"F32","v":96288},{"$f":"G32","v":88944},{"$f":"C10","v":118320},{"$f":"D10","v":110976},{"$f":"E10","v":103632},{"$f":"F10","v":96288},{"$f":"G10","v":88944}]
{"$rows_left_out":64}
{"sheet":"FatorEmissao","index":5,"n_rows":35,"n_cols":21,"rows_kept":35,"cut":false,"hidden":false,"merged":[[9,15,9,17],[2,15,2,17],[13,15,13,16],[20,15,20,18],[27,15,27,18],[16,15,16,18]]}
[null,null,null,null,null,null,null,null,null,null,null,null,null,null,null,"Fatores de emissão utilizados para o óleo diesel"]
[null,"Abril","Outubro",null,null,null,null,null,null,null,null,null,null,null,null,"Decisão em 13/08: corrigir a fórmula para o cálculo de emissões de CO2-eq",null,null,null,null,"campos para alteração"]
[1995,null,null,null,null,null,null,null,null,null,null,null,null,null,null,"Fator de emissão CO2-eq = FE(CO2) + FE(CH4) + FE(N2O)"]
[1996,4.46,4.37,null,null,null,null,null,null,null,null,null,null,null,null,"Poluente","Unidade"]
[1997,3.93,4,null,null,null,null,null,null,null,null,null,null,null,null,"CO2","tCO2-eq/10³tep",3070]
[1998,4.4000000000000004,4.3600000000000003,null,"Idade média da frota de ônibus urbanos municipais nas princpais capitais",null,null,null,null,null,null,null,null,null,null,"CH4","tCO2-eq/10³tep",2.6379999999999999]
[1999,4.33,4.83,null,"Fonte: Anuário NTU (2018) - pág. 52",null,null,null,null,null,null,null,null,null,null,"N2O","tCO2-eq/10³tep",7.7880000000000003]
[2000,4.83,5.15,null,null,null,null,null,null,null,null,null,null,null,null,"Total","tCO2-eq/10³tep",{"$f":"SUM(R5:R7)","v":3080.4259999999999}]
[2001,4.92,5.09]
[2002,5.6,5.69,null,null,null,null,null,null,null,null,null,null,null,null,"Fator de conversão"]
{"$rows_left_out":26}
{"sheet":"SeriePreçoDiesel","index":6,"n_rows":66,"n_cols":87,"rows_kept":66,"cut":false,"hidden":false,"merged":[[65,0,65,1]]}
[null,"Rótulos de Linha","2013-01-01","2013-02-01","2013-03-01","2013-04-01","2013-05-01","2013-06-01","2013-07-01","2013-08-01","2013-09-01","2013-10-01","2013-11-01","2013-12-01","2014-01-01","2014-02-01","2014-03-01","2014-04-01","2014-05-01","2014-06-01","2014-07-01","2014-08-01","2014-09-01","2014-10-01","2014-11-01","2014-12-01","2015-01-01","2015-02-01","2015-03-01","2015-04-01","2015-05-01","2015-06-01","2015-07-01","2015-08-01","2015-09-01","2015-10-01","2015-11-01","2015-12-01","2016-01-01","2016-02-01","2016-03-01","2016-04-01","2016-05-01","2016-06-01","2016-07-01","2016-08-01","2016-09-01","2016-10-01","2016-11-01","2016-12-01","2017-01-01","2017-02-01","2017-03-01","2017-04-01","2017-05-01","2017-06-01","2017-07-01","2017-08-01","2017-09-01","2017-10-01","2017-11-01","2017-12-01","2018-01-01","2018-02-01","2018-03-01","2018-04-01","2018-05-01","2018-06-01","2018-07-01","2018-08-01","2018-09-01","2018-10-01","2018-11-01","2018-12-01","2019-01-01","2019-02-01","2019-03-01","2019-04-01","2019-05-01","2019-06-01","2019-07-01","2019-08-01","2019-09-01","2019-10-01","2019-11-01","2019-12-01","2020-01-01"]
[null,"ACRE",2.286,2.3199999999999998,2.3330000000000002,2.3959999999999999,2.4089999999999998,2.387,2.3849999999999998,2.4049999999999998,2.4009999999999998,2.415,2.4409999999999998,2.5099999999999998,2.5720000000000001,2.5720000000000001,2.5720000000000001,2.6019999999999999,2.5750000000000002,2.5720000000000001,2.5630000000000002,2.569,2.5609999999999999,2.5489999999999999,2.6160000000000001,2.69,2.71,2.7930000000000001,2.851,2.859,2.8690000000000002,2.87,2.88,2.9159999999999999,2.8980000000000001,2.968,3.0830000000000002,3.0920000000000001,3.1040000000000001,3.097,3.08,3.0680000000000001,3.073,3.0659999999999998,3.0640000000000001,3.0489999999999999,3.0640000000000001,3.0739999999999998,3.0459999999999998,3.0150000000000001,3.1269999999999998,3.0910000000000002,3.0009999999999999,2.952,2.96,2.9119999999999999,2.8839999999999999,3.1030000000000002,3.1749999999999998,3.2509999999999999,3.3180000000000001,3.3780000000000001,3.5009999999999999,3.4529999999999998,3.4180000000000001,3.6379999999999999,3.8109999999999999,3.7149999999999999,3.6389999999999998,3.6230000000000002,3.71,3.8639999999999999,3.9409999999999998,3.8650000000000002,3.8109999999999999,3.8010000000000002,3.9249999999999998,3.8839999999999999,3.9350000000000001,3.9369999999999998,3.9089999999999998,3.8519999999999999,3.915,3.9409999999999998,3.9239999999999999,3.948,3.988]
[null,"ALAGOAS",1.917,1.956,2.0209999999999999,2.0590000000000002,2.0590000000000002,2.0590000000000002,2.0550000000000002,2.056,2.0590000000000002,2.052,2.0550000000000002,2.1349999999999998,2.1829999999999998,2.1850000000000001,2.1890000000000001,2.1869999999999998,2.1840000000000002,2.2000000000000002,2.2000000000000002,2.206,2.2090000000000001,2.206,2.2519999999999998,2.3119999999999998,2.3239999999999998,2.41,2.488,2.4910000000000001,2.4980000000000002,2.5030000000000001,2.5110000000000001,2.5230000000000001,2.5299999999999998,2.5920000000000001,2.6440000000000001,2.661,2.6970000000000001,2.722,2.7440000000000002,2.7389999999999999,2.7360000000000002,2.7210000000000001,2.7160000000000002,2.722,2.7120000000000002,2.7040000000000002,2.637,2.6659999999999999,2.7410000000000001,2.7450000000000001,2.67,2.6379999999999999,2.6360000000000001,2.62,2.5489999999999999,2.7090000000000001,2.786,2.907,2.9470000000000001,2.9660000000000002,3.081,3.081,3.0619999999999998,3.1669999999999998,3.4159999999999999,3.234,3.1629999999999998,3.1680000000000001,3.371,3.4990000000000001,3.4780000000000002,3.3250000000000002,3.198,3.254,3.3919999999999999,3.3679999999999999,3.3690000000000002,3.39,3.2970000000000002,3.2490000000000001,3.3879999999999999,3.5070000000000001,3.4910000000000001,3.5619999999999998,3.544]
[null,"AMAPA",2.008,2.048,2.1280000000000001,2.125,2.13,2.1520000000000001,2.1419999999999999,2.133,2.129,2.1309999999999998,2.1339999999999999,2.218,2.294,2.3050000000000002,2.3079999999999998,2.3069999999999999,2.3180000000000001,2.34,2.3490000000000002,2.355,2.3580000000000001,2.355,2.4020000000000001,2.4660000000000002,2.4910000000000001,2.6019999999999999,2.6579999999999999,2.6560000000000001,2.6389999999999998,2.6429999999999998,2.7069999999999999,2.738,2.798,2.871,2.9159999999999999,2.9260000000000002,2.9319999999999999,3.0910000000000002,3.2269999999999999,3.2650000000000001,3.2850000000000001,3.2690000000000001,3.2690000000000001,3.27,3.286,3.31,3.3029999999999999,3.2989999999999999,3.3420000000000001,3.2989999999999999,3.1509999999999998,3.1469999999999998,3.1320000000000001,2.9980000000000002,2.9580000000000002,3.0990000000000002,3.25,3.351,3.427,3.5819999999999999,3.629,3.6219999999999999,3.585,3.7149999999999999,3.8959999999999999,3.7050000000000001,3.3980000000000001,3.3690000000000002,3.5790000000000002,3.6659999999999999,3.59,3.448,3.617,3.7330000000000001,3.6819999999999999,3.706,3.8359999999999999,3.6840000000000002,3.63,3.6640000000000001,3.7229999999999999,3.9620000000000002,3.9470000000000001,3.9630000000000001,3.964]
[null,"AMAZONAS",2.0110000000000001,2.0750000000000002,2.12,2.1459999999999999,2.145,2.145,2.1379999999999999,2.1339999999999999,2.14,2.1379999999999999,2.1379999999999999,2.2429999999999999,2.3050000000000002,2.3220000000000001,2.3210000000000002,2.3220000000000001,2.3170000000000002,2.3170000000000002,2.323,2.33,2.3279999999999998,2.3250000000000002,2.383,2.4340000000000002,2.448,2.54,2.605,2.6139999999999999,2.6259999999999999,2.633,2.6469999999999998,2.6560000000000001,2.66,2.7229999999999999,2.8,2.82,2.8420000000000001,2.8639999999999999,2.8620000000000001,2.87,2.8530000000000002,2.8540000000000001,2.86,2.843,2.8519999999999999,2.8479999999999999,2.8380000000000001,2.8170000000000002,2.9350000000000001,2.8540000000000001,2.774,2.738,2.7120000000000002,2.6469999999999998,2.6160000000000001,2.81,2.9889999999999999,2.9820000000000002,3.032,3.0409999999999999,3.129,3.1539999999999999,3.129,3.2069999999999999,3.3330000000000002,3.2650000000000001,3.15,3.1589999999999998,3.3210000000000002,3.4750000000000001,3.46,3.2949999999999999,3.2280000000000002,3.2669999999999999,3.3490000000000002,3.3490000000000002,3.45,3.3919999999999999,3.347,3.3130000000000002,3.4209999999999998,3.532,3.484,3.5169999999999999,3.5310000000000001]
[null,"BAHIA",1.865,1.9510000000000001,2.0110000000000001,2.0449999999999999,2.0369999999999999,2.0310000000000001,2.0339999999999998,2.0270000000000001,2.0209999999999999,2.0169999999999999,2.0219999999999998,2.1309999999999998,2.1749999999999998,2.1760000000000002,2.1709999999999998,2.165,2.1640000000000001,2.16,2.1619999999999999,2.16,2.16,2.157,2.1890000000000001,2.2679999999999998,2.2759999999999998,2.387,2.4500000000000002,2.4409999999999998,2.4279999999999999,2.4319999999999999,2.4449999999999998,2.4569999999999999,2.4710000000000001,2.5720000000000001,2.645,2.6560000000000001,2.6659999999999999,2.6789999999999998,2.6680000000000001,2.66,2.67,2.6589999999999998,2.661,2.6619999999999999,2.6539999999999999,2.6440000000000001,2.5920000000000001,2.5819999999999999,2.6789999999999998,2.65,2.5579999999999998,2.5169999999999999,2.5920000000000001,2.544,2.4740000000000002,2.6850000000000001,2.754,2.8290000000000002,2.883,2.923,3.0219999999999998,3.0089999999999999,2.984,3.089,3.2789999999999999,3.169,3.0979999999999999,3.089,3.2909999999999999,3.4049999999999998,3.2829999999999999,3.0880000000000001,3.0249999999999999,3.0950000000000002,3.1720000000000002,3.1930000000000001,3.2989999999999999,3.238,3.15,3.117,3.2069999999999999,3.359,3.359,3.375,3.4249999999999998]
[null,"CEARA",1.944,1.99,2.04,2.0579999999999998,2.0550000000000002,2.0339999999999998,2.06,2.0649999999999999,2.0659999999999998,2.0609999999999999,2.0590000000000002,2.1269999999999998,2.2189999999999999,2.2170000000000001,2.2130000000000001,2.2200000000000002,2.242,2.2290000000000001,2.2519999999999998,2.2759999999999998,2.2869999999999999,2.2799999999999998,2.2890000000000001,2.3410000000000002,2.3559999999999999,2.4060000000000001,2.5169999999999999,2.5270000000000001,2.5640000000000001,2.5670000000000002,2.573,2.5720000000000001,2.5590000000000002,2.6179999999999999,2.738,2.7370000000000001,2.7610000000000001,2.7770000000000001,2.79,2.7789999999999999,2.7749999999999999,2.7770000000000001,2.8050000000000002,2.8149999999999999,2.81,2.7879999999999998,2.7730000000000001,2.786,2.8460000000000001,2.8380000000000001,2.7919999999999998,2.6960000000000002,2.7330000000000001,2.698,2.6549999999999998,2.7559999999999998,2.7930000000000001,2.875,2.9209999999999998,2.9820000000000002,3.0430000000000001,3.069,3.073,3.133,3.2869999999999999,3.181,3.1309999999999998,3.137,3.2709999999999999,3.4289999999999998,3.4740000000000002,3.3460000000000001,3.1970000000000001,3.2349999999999999,3.3050000000000002,3.3519999999999999,3.4350000000000001,3.403,3.3340000000000001,3.319,3.3380000000000001,3.4769999999999999,3.508,3.5110000000000001,3.5649999999999999]
[null,"DISTRITO FEDERAL",1.95,2.0510000000000002,2.1779999999999999,2.137,2.1190000000000002,2.113,2.117,2.1190000000000002,2.121,2.1259999999999999,2.1269999999999998,2.2240000000000002,2.2309999999999999,2.2400000000000002,2.262,2.2709999999999999,2.2709999999999999,2.27,2.2719999999999998,2.274,2.2799999999999998,2.2890000000000001,2.3370000000000002,2.375,2.375,2.504,2.492,2.4860000000000002,2.488,2.4910000000000001,2.4940000000000002,2.5019999999999998,2.5419999999999998,2.601,2.653,2.65,2.7690000000000001,2.8079999999999998,2.798,2.8159999999999998,2.798,2.786,2.774,2.7839999999999998,2.786,2.7730000000000001,2.7469999999999999,2.7160000000000002,2.903,2.91,2.794,2.758,2.8130000000000002,2.7450000000000001,2.6579999999999999,2.8959999999999999,3.1110000000000002,3.13,3.2040000000000002,3.1739999999999999,3.2370000000000001,3.1850000000000001,3.2090000000000001,3.3769999999999998,3.5550000000000002,3.2559999999999998,3.226,3.2309999999999999,3.4140000000000001,3.5459999999999998,3.4510000000000001,3.1850000000000001,3.198,3.254,3.3519999999999999,3.359,3.4750000000000001,3.34,3.2690000000000001,3.2759999999999998,3.407,3.5019999999999998,3.49,3.5129999999999999,3.5790000000000002]
[null,"ESPIRITO SANTO",1.9219999999999999,2.0289999999999999,2.0310000000000001,2.085,2.09,2.09,2.0680000000000001,2.0630000000000002,2.0489999999999999,2.0430000000000001,2.0499999999999998,2.15,2.1779999999999999,2.2109999999999999,2.2069999999999999,2.2160000000000002,2.2240000000000002,2.2170000000000001,2.1739999999999999,2.1720000000000002,2.1869999999999998,2.19,2.2189999999999999,2.2519999999999998,2.266,2.4060000000000001,2.4740000000000002,2.4550000000000001,2.4740000000000002,2.4670000000000001,2.4710000000000001,2.4809999999999999,2.4870000000000001,2.5750000000000002,2.6269999999999998,2.641,2.653,2.6589999999999998,2.6549999999999998,2.6509999999999998,2.6509999999999998,2.653,2.657,2.6579999999999999,2.6869999999999998,2.6619999999999999,2.613,2.625,2.7280000000000002,2.7050000000000001,2.6440000000000001,2.601,2.6509999999999998,2.6110000000000002,2.5630000000000002,2.8079999999999998,2.8570000000000002,2.911,2.931,2.9279999999999999,2.9409999999999998,2.9550000000000001,2.9729999999999999,3.0019999999999998,3.1749999999999998,2.9710000000000001,2.9089999999999998,2.9140000000000001,3.1419999999999999,3.238,3.2080000000000002,3.0030000000000001,2.96,3.0289999999999999,3.1110000000000002,3.177,3.2989999999999999,3.1970000000000001,3.117,3.089,3.1779999999999999,3.3380000000000001,3.3090000000000002,3.347,3.3860000000000001]
[null,"GOIAS",1.952,2.0009999999999999,2.0190000000000001,2.0710000000000002,2.0750000000000002,2.0830000000000002,2.0840000000000001,2.0920000000000001,2.1019999999999999,2.113,2.113,2.2349999999999999,2.2450000000000001,2.254,2.2629999999999999,2.2759999999999998,2.2850000000000001,2.2730000000000001,2.2709999999999999,2.2829999999999999,2.282,2.294,2.3170000000000002,2.3660000000000001,2.3719999999999999,2.4460000000000002,2.4940000000000002,2.5419999999999998,2.556,2.5710000000000002,2.5830000000000002,2.5939999999999999,2.6259999999999999,2.7050000000000001,2.7269999999999999,2.7280000000000002,2.754,2.7770000000000001,2.7749999999999999,2.7589999999999999,2.738,2.754,2.7389999999999999,2.738,2.74,2.7410000000000001,2.7269999999999999,2.7210000000000001,2.8109999999999999,2.863,2.8380000000000001,2.8119999999999998,2.794,2.7719999999999998,2.7360000000000002,2.87,2.86,2.8969999999999998,2.9329999999999998,2.948,3.0019999999999998,2.996,3.004,3.0430000000000001,3.1920000000000002,3.2149999999999999,3.1560000000000001,3.1709999999999998,3.367,3.4660000000000002,3.379,3.12,3.0859999999999999,3.1429999999999998,3.238,3.2519999999999998,3.3660000000000001,3.3069999999999999,3.222,3.2029999999999998,3.33,3.4209999999999998,3.4340000000000002,3.4980000000000002,3.5350000000000001]
{"$rows_left_out":57}
{"sheet":"PreçoDiesel","index":7,"n_rows":33,"n_cols":5,"rows_kept":33,"cut":false,"hidden":false,"merged":[]}
["Chave","UF","SIGLA","Preço Médio Janeiro de 2020"]
[1,"Escolha o Estado","UF",{"$f":"SeriePreçoDiesel!CI34","v":3.5148471925925917}]
[2,"ACRE","AC",{"$f":"SeriePreçoDiesel!CI35","v":3.9963747999999999}]
[3,"ALAGOAS","AL",{"$f":"SeriePreçoDiesel!CI36","v":3.5514424}]
[4,"AMAPA","AP",{"$f":"SeriePreçoDiesel!CI37","v":3.9723243999999998}]
[5,"AMAZONAS","AM",{"$f":"SeriePreçoDiesel!CI38","v":3.5384150999999999},"Voltar ao Formulário"]
[6,"BAHIA","BA",{"$f":"SeriePreçoDiesel!CI39","v":3.4321924999999998}]
[7,"CEARA","CE",{"$f":"SeriePreçoDiesel!CI40","v":3.5724865000000001}]
[8,"DISTRITO FEDERAL","DF",{"$f":"SeriePreçoDiesel!CI41","v":3.5865159000000002}]
[9,"ESPIRITO SANTO","ES",{"$f":"SeriePreçoDiesel!CI42","v":3.3931106}]
{"$rows_left_out":23}